Visual Studio Community 2019 Publish Error

  Uncategorised

I trying to publish my application through file system and it throws the following error

enter image description here

17-04-2021 09:41:43
System.AggregateException: One or more errors occurred. —> Microsoft.WebTools.Shared.Exceptions.WebToolsException: Build failed. Check the Output window for more details.
— End of inner exception stack trace —
—> (Inner Exception #0) Microsoft.WebTools.Shared.Exceptions.WebToolsException: Build failed. Check the Output window for more details.<—

Microsoft.WebTools.Shared.Exceptions.WebToolsException: Build failed. Check the Output window for more details.

===================

Please do let me know as am struggling with this issue.

Source: Visual Studio Questions

2 thoughts on - Visual Studio Community 2019 Publish Error

  • There are many nuget packages for my application. What do u mean. Do i need to update all nuget packages or some particular one to clear this issue or what….?

LEAVE A COMMENT