Category : makefile

I’m trying to install the RTL8192EU driver from github but I’m getting the following compiler errors. /bin/sh: 1: bc: not found make ARCH=x86_64 CROSS_COMPILE= -C /lib/modules/4.19.0-kali4-amd64/build M=/root/RTL8192EU modules make[1]: Entering directory ‘/usr/src/linux-headers-4.19.0-kali4-amd64’ /bin/sh: 1: bc: not found CC [M] /root/RTL8192EU/core/rtw_cmd.o CC [M] /root/RTL8192EU/core/rtw_security.o CC [M] /root/RTL8192EU/core/rtw_debug.o /root/RTL8192EU/core/rtw_debug.c: In function ‘dump_drv_version’: /root/RTL8192EU/core/rtw_debug.c:45:62: error: macro "__DATE__" might ..

Read more

I’m currently trying to write a Makefile which searches the current directory and all sub-directories for C++ files. Then compiles them one by one (IF they haven’t already been compiled or edited since the last time it was compiled) into an individual Object file at the location ./Objects. Before finally using the Object files and ..

Read more

I need to install make command on windows, and I am told to follow the guide here: https://gist.github.com/evanwill/0207876c3243bbb6863e65ec5dc3f058#make, which is quoted as follows: Go to ezwinports. Download make-4.1-2-without-guile-w32-bin.zip (get the version without guile). Extract zip. Copy the contents to your Gitmingw64 merging the folders, but do NOT overwrite/replace any existing files. (Keep in mind you ..

Read more

I’m trying to use Linux TTY Driver Ver 1.0.15.0 of this product. I did all the steps in README_Ubuntu, copying header files in my project dir. However, it failes to compile, complaining that /tmp/ccH3NfSt.o: In function `main’: main.cpp:(.text+0x5): undefined reference to `dp_lib_init()’ collect2: error: ld returned 1 exit status To compile my main.cpp, I used ..

Read more

I am getting error when compiling tensorflow C++ framework. But I get error. After searching about the error I kind of found that tensorflow depends on AVR device which I may/or may not have. This is the error ERROR: /root/.cache/bazel/_bazel_root/01d0d1781e05f68005abbf38d8bf5d12/external/llvm-project/mlir/BUILD:151:18: TdGenerate external/llvm-project/mlir/include/mlir/IR/BuiltinAttributes.cpp.inc failed (Illegal instruction): mlir-tblgen failed: error executing command bazel-out/k8-opt-exec-50AE0418/bin/external/llvm-project/mlir/mlir-tblgen –gen-attrdef-defs external/llvm-project/mlir/include/mlir/IR/BuiltinAttributes.td -I external/llvm-project/mlir/include ..

Read more